Target
Capsid scaffolding protein
Ligand
BDBM50133951
Substrate
Meas. Tech.
ChEMBL_158964 (CHEMBL769610)
Ki
7.4±n/a nM
Citation
 Borthwick, ADDavies, DEErtl, PFExall, AMHaley, TMHart, GJJackson, DLParry, NRPatikis, ATrivedi, NWeingarten, GGWoolven, JM Design and synthesis of pyrrolidine-5,5'-trans-lactams (5-oxo-hexahydropyrrolo[3,2-b]pyrroles) as novel mechanism-based inhibitors of human cytomegalovirus protease. 4. Antiviral activity and plasma stability. J Med Chem 46:4428-49 (2003)  
Target
Name:
Capsid scaffolding protein
Synonyms:
APNG Assembly protein Human cytomegalovirus protease (HCMV Pr) Protease precursor UL80 | pPR
Type:
PROTEIN
Mol. Mass.:
73854.16
Organism:
Human cytomegalovirus (strain AD169) (HHV-5) (Human herpesvirus 5)
Description:
ChEMBL_158958
Residue:
708
  
Inhibitor
Name:
BDBM50133951
Synonyms:
2-{(3S,3aR,6aS)-4-[(S)-1-(4-Isopropyl-phenylcarbamoyl)-pyrrolidine-2-carbonyl]-3-methyl-2-oxo-hexahydro-pyrrolo[3,2-b]pyrrol-1-yl}-benzothiazole-6-carboxylic acid ethyl ester | CHEMBL342871
Type:
Small organic molecule
Emp. Form.:
C32H37N5O5S
Mol. Mass.:
603.732
SMILES:
CCOC(=O)c1ccc2nc(sc2c1)N1[C@H]2CCN([C@@H]2[C@H](C)C1=O)C(=O)[C@@H]1CCCN1C(=O)Nc1ccc(cc1)C(C)C
: