Target
Capsid scaffolding protein
Ligand
BDBM50133953
Substrate
Meas. Tech.
ChEMBL_158964 (CHEMBL769610)
Ki
21±n/a nM
Citation
 Borthwick, ADDavies, DEErtl, PFExall, AMHaley, TMHart, GJJackson, DLParry, NRPatikis, ATrivedi, NWeingarten, GGWoolven, JM Design and synthesis of pyrrolidine-5,5'-trans-lactams (5-oxo-hexahydropyrrolo[3,2-b]pyrroles) as novel mechanism-based inhibitors of human cytomegalovirus protease. 4. Antiviral activity and plasma stability. J Med Chem 46:4428-49 (2003)  
Target
Name:
Capsid scaffolding protein
Synonyms:
APNG Assembly protein Human cytomegalovirus protease (HCMV Pr) Protease precursor UL80 | pPR
Type:
PROTEIN
Mol. Mass.:
73854.16
Organism:
Human cytomegalovirus (strain AD169) (HHV-5) (Human herpesvirus 5)
Description:
ChEMBL_158958
Residue:
708
  
Inhibitor
Name:
BDBM50133953
Synonyms:
(S)-2-((3aS,6S,6aR)-6-Methyl-5-oxo-4-thiazolo[5,4-b]pyridin-2-yl-hexahydro-pyrrolo[3,2-b]pyrrole-1-carbonyl)-pyrrolidine-1-carboxylic acid (4-isopropyl-phenyl)-amide | CHEMBL341583
Type:
Small organic molecule
Emp. Form.:
C28H32N6O3S
Mol. Mass.:
532.657
SMILES:
CC(C)c1ccc(NC(=O)N2CCC[C@H]2C(=O)N2CC[C@H]3[C@H]2[C@H](C)C(=O)N3c2nc3cccnc3s2)cc1
: