Target
Capsid scaffolding protein
Ligand
BDBM50133954
Substrate
Meas. Tech.
ChEMBL_158964 (CHEMBL769610)
Ki
79±n/a nM
Citation
 Borthwick, ADDavies, DEErtl, PFExall, AMHaley, TMHart, GJJackson, DLParry, NRPatikis, ATrivedi, NWeingarten, GGWoolven, JM Design and synthesis of pyrrolidine-5,5'-trans-lactams (5-oxo-hexahydropyrrolo[3,2-b]pyrroles) as novel mechanism-based inhibitors of human cytomegalovirus protease. 4. Antiviral activity and plasma stability. J Med Chem 46:4428-49 (2003)  
Target
Name:
Capsid scaffolding protein
Synonyms:
APNG Assembly protein Human cytomegalovirus protease (HCMV Pr) Protease precursor UL80 | pPR
Type:
PROTEIN
Mol. Mass.:
73854.16
Organism:
Human cytomegalovirus (strain AD169) (HHV-5) (Human herpesvirus 5)
Description:
ChEMBL_158958
Residue:
708
  
Inhibitor
Name:
BDBM50133954
Synonyms:
(3S,3aR,6aS)-1-Cyclopropanecarbonyl-3-methyl-4-[(S)-1-(4-propoxy-benzoyl)-pyrrolidine-2-carbonyl]-hexahydro-pyrrolo[3,2-b]pyrrol-2-one | CHEMBL138211
Type:
Small organic molecule
Emp. Form.:
C26H33N3O5
Mol. Mass.:
467.5573
SMILES:
CCCOc1ccc(cc1)C(=O)N1CCC[C@H]1C(=O)N1CC[C@H]2[C@H]1[C@H](C)C(=O)N2C(=O)C1CC1
: