Target
Telomerase reverse transcriptase
Ligand
BDBM50134007
Substrate
Meas. Tech.
ChEMBL_210064 (CHEMBL813588)
EC50
210±n/a nM
Citation
 Harrison, RJCuesta, JChessari, GRead, MABasra, SKReszka, APMorrell, JGowan, SMIncles, CMTanious, FAWilson, WDKelland, LRNeidle, S Trisubstituted acridine derivatives as potent and selective telomerase inhibitors. J Med Chem 46:4463-76 (2003)  
Target
Name:
Telomerase reverse transcriptase
Synonyms:
EST2 TERT TRT
Type:
PROTEIN
Mol. Mass.:
127099.03
Organism:
Homo sapiens (Human)
Description:
ChEMBL_1447029
Residue:
1132
  
Inhibitor
Name:
BDBM50134007
Synonyms:
CHEMBL337123 | N-[9-Heptylamino-6-(3-pyrrolidin-1-yl-propionylamino)-acridin-3-yl]-3-pyrrolidin-1-yl-propionamide
Type:
Small organic molecule
Emp. Form.:
C34H48N6O2
Mol. Mass.:
572.7839
SMILES:
CCCCCCCNc1c2ccc(NC(=O)CCN3CCCC3)cc2nc2cc(NC(=O)CCN3CCCC3)ccc12
: