Target
Telomerase reverse transcriptase
Ligand
BDBM50134011
Substrate
Meas. Tech.
ChEMBL_210064 (CHEMBL813588)
EC50
21±n/a nM
Citation
 Harrison, RJCuesta, JChessari, GRead, MABasra, SKReszka, APMorrell, JGowan, SMIncles, CMTanious, FAWilson, WDKelland, LRNeidle, S Trisubstituted acridine derivatives as potent and selective telomerase inhibitors. J Med Chem 46:4463-76 (2003)  
Target
Name:
Telomerase reverse transcriptase
Synonyms:
EST2 TERT TRT
Type:
PROTEIN
Mol. Mass.:
127099.03
Organism:
Homo sapiens (Human)
Description:
ChEMBL_1447029
Residue:
1132
  
Inhibitor
Name:
BDBM50134011
Synonyms:
CHEMBL343609 N-[9-(2-Amino-phenylamino)-6-(3-pyrrolidin-1-yl-propionylamino)-acridin-2-yl]-3-pyrrolidin-1-yl-propionamide
Type:
Small organic molecule
Emp. Form.:
C33H39N7O2
Mol. Mass.:
565.7085
SMILES:
Nc1ccccc1Nc1c2ccc(NC(=O)CCN3CCCC3)cc2nc2ccc(NC(=O)CCN3CCCC3)cc12
: