Target
Telomerase reverse transcriptase
Ligand
BDBM50134022
Substrate
Meas. Tech.
ChEMBL_210064 (CHEMBL813588)
EC50
40±n/a nM
Citation
 Harrison, RJCuesta, JChessari, GRead, MABasra, SKReszka, APMorrell, JGowan, SMIncles, CMTanious, FAWilson, WDKelland, LRNeidle, S Trisubstituted acridine derivatives as potent and selective telomerase inhibitors. J Med Chem 46:4463-76 (2003)  
Target
Name:
Telomerase reverse transcriptase
Synonyms:
EST2 TERT TRT
Type:
PROTEIN
Mol. Mass.:
127099.03
Organism:
Homo sapiens (Human)
Description:
ChEMBL_1447029
Residue:
1132
  
Inhibitor
Name:
BDBM50134022
Synonyms:
CHEMBL336444 N-[9-(4-Acetylamino-phenylamino)-6-(3-pyrrolidin-1-yl-propionylamino)-acridin-3-yl]-3-pyrrolidin-1-yl-propionamide
Type:
Small organic molecule
Emp. Form.:
C35H40N6O3
Mol. Mass.:
592.7305
SMILES:
CC(=O)c1ccc(Nc2c3ccc(NC(=O)CCN4CCCC4)cc3nc3cc(NC(=O)CCN4CCCC4)ccc23)cc1
: