Target
Telomerase reverse transcriptase
Ligand
BDBM50134001
Substrate
Meas. Tech.
ChEMBL_210064 (CHEMBL813588)
EC50
270±n/a nM
Citation
 Harrison, RJCuesta, JChessari, GRead, MABasra, SKReszka, APMorrell, JGowan, SMIncles, CMTanious, FAWilson, WDKelland, LRNeidle, S Trisubstituted acridine derivatives as potent and selective telomerase inhibitors. J Med Chem 46:4463-76 (2003)  
Target
Name:
Telomerase reverse transcriptase
Synonyms:
EST2 TERT TRT
Type:
PROTEIN
Mol. Mass.:
127099.03
Organism:
Homo sapiens (Human)
Description:
ChEMBL_1447029
Residue:
1132
  
Inhibitor
Name:
BDBM50134001
Synonyms:
CHEMBL140084 N-[9-(2-Dimethylamino-ethylamino)-6-(3-pyrrolidin-1-yl-propionylamino)-acridin-2-yl]-3-pyrrolidin-1-yl-propionamide
Type:
Small organic molecule
Emp. Form.:
C31H43N7O2
Mol. Mass.:
545.7188
SMILES:
CN(C)CCNc1c2ccc(NC(=O)CCN3CCCC3)cc2nc2ccc(NC(=O)CCN3CCCC3)cc12
: