Target
cAMP-specific 3',5'-cyclic phosphodiesterase 4A/4B/4C/4D
Ligand
BDBM14777
Substrate
Meas. Tech.
ChEMBL_157041 (CHEMBL765684)
IC50
>10000±n/a nM
Citation
 Daugan, AGrondin, PRuault, CLe Monnier de Gouville, ACCoste, HLinget, JMKirilovsky, JHyafil, FLabaudinière, R The discovery of tadalafil: a novel and highly selective PDE5 inhibitor. 2: 2,3,6,7,12,12a-hexahydropyrazino[1',2':1,6]pyrido[3,4-b]indole-1,4-dione analogues. J Med Chem 46:4533-42 (2003)  
Target
Name:
cAMP-specific 3',5'-cyclic phosphodiesterase 4A/4B/4C/4D
Synonyms:
Phosphodiesterase 4
Type:
Mol. Mass.:
Description:
ASSAY_ID of ChEMBL is 788178
Components:
This complex has 4 components.
Component 1
Name:
cAMP-specific 3',5'-cyclic phosphodiesterase 4A
Synonyms:
3',5'-cyclic phosphodiesterase PDE46 PDE4A_HUMAN Phosphodiesterase 4A | Phosphodiesterase 4A (PDE4)
Type:
Enzyme
Mol. Mass.:
98113.27
Organism:
Homo sapiens (Human)
Description:
P27815
Residue:
886
  
Component 2
Name:
cAMP-specific 3',5'-cyclic phosphodiesterase 4D
Synonyms:
3',5'-cyclic phosphodiesterase PDE43 PDE4D_HUMAN | Phosphodiesterase 4D
Type:
Protein
Mol. Mass.:
91092.69
Organism:
Homo sapiens (Human)
Description:
Q08499
Residue:
809
  
Component 3
Name:
cAMP-specific 3',5'-cyclic phosphodiesterase 4B
Synonyms:
3',5'-cyclic phosphodiesterase Isoform PDE4B1 PDE4B PDE4B_HUMAN Phosphodiesterase 4B (PDE4B) Phosphodiesterase Type 4 (PDE4B)
Type:
Protein
Mol. Mass.:
83318.87
Organism:
Homo sapiens (Human)
Description:
Q07343
Residue:
736
  
Component 4
Name:
cAMP-specific 3',5'-cyclic phosphodiesterase 4C
Synonyms:
3',5'-cyclic phosphodiesterase NP_000914.2 PDE4C | PDE4C1
Type:
Enzyme Catalytic Domain
Mol. Mass.:
79875.54
Organism:
Homo sapiens (Human)
Description:
Q08493
Residue:
712
  
Inhibitor
Name:
BDBM14777
Synonyms:
(2R,8R)-2-(2H-1,3-benzodioxol-5-yl)-6-methyl-3,6,17-triazatetracyclo[8.7.0.0^{3,8}.0^{11,16}]heptadeca-1(10),11(16),12,14-tetraene-4,7-dione CHEMBL779 GF 196960 | Tadalafil
Type:
Small organic molecule
Emp. Form.:
C22H19N3O4
Mol. Mass.:
389.404
SMILES:
[H][C@]12Cc3c([nH]c4ccccc34)[C@H](N1C(=O)CN(C)C2=O)c1ccc2OCOc2c1
: