Target
3-oxoacyl-[acyl-carrier-protein] synthase 3
Ligand
BDBM50134356
Substrate
Meas. Tech.
ChEBML_37595
IC50
25000±n/a nM
Citation
 Senior, SJIllarionov, PAGurcha, SSCampbell, IBSchaeffer, MLMinnikin, DEBesra, GS Biphenyl-based analogues of thiolactomycin, active against Mycobacterium tuberculosis mtFabH fatty acid condensing enzyme. Bioorg Med Chem Lett 13:3685-8 (2003)  
Target
Name:
3-oxoacyl-[acyl-carrier-protein] synthase 3
Synonyms:
β-Ketoacyl-acyl carrier protein (ACP) synthase III (FabH) FABH_MYCTU | fabH
Type:
Enzyme
Mol. Mass.:
34865.07
Organism:
Mycobacterium tuberculosis
Description:
P9WNG3
Residue:
335
  
Inhibitor
Name:
BDBM50134356
Synonyms:
5-(4'-tert-Butyl-biphenyl-4-ylmethyl)-4-hydroxy-3,5-dimethyl-5H-thiophen-2-one | CHEMBL123594
Type:
Small organic molecule
Emp. Form.:
C23H26O2S
Mol. Mass.:
366.516
SMILES:
CC1C(=O)SC(C)(Cc2ccc(cc2)-c2ccc(cc2)C(C)(C)C)C1=O
: