Target
Adenosine kinase
Ligand
BDBM50042349
Substrate
Meas. Tech.
ChEMBL_31113 (CHEMBL642224)
IC50
26±n/a nM
Citation
 Ugarkar, BGCastellino, AJDaRe, JSRamirez-Weinhouse, MKopcho, JJRosengren, SErion, MD Adenosine kinase inhibitors. 3. Synthesis, SAR, and antiinflammatory activity of a series of l-lyxofuranosyl nucleosides. J Med Chem 46:4750-60 (2003)  
Target
Name:
Adenosine kinase
Synonyms:
ADK | ADK_HUMAN
Type:
PROTEIN
Mol. Mass.:
40545.97
Organism:
Homo sapiens (Human)
Description:
ChEMBL_1467841
Residue:
362
  
Inhibitor
Name:
BDBM50042349
Synonyms:
2-(4-Amino-5-iodo-pyrrolo[2,3-d]pyrimidin-7-yl)-5-hydroxymethyl-tetrahydro-furan-3,4-diol(Iodotubercidin) | CHEMBL99203
Type:
Small organic molecule
Emp. Form.:
C11H13IN4O4
Mol. Mass.:
392.1498
SMILES:
Nc1ncnc2n(cc(I)c12)[C@@H]1O[C@H](CO)C(O)C1O
: