Target
Melanocortin receptor 5
Ligand
BDBM50134944
Substrate
Meas. Tech.
ChEMBL_106655 (CHEMBL713000)
Ki
1700±n/a nM
Citation
 Balse-Srinivasan, PGrieco, PCai, MTrivedi, DHruby, VJ Structure-activity relationships of gamma-MSH analogues at the human melanocortin MC3, MC4, and MC5 receptors. Discovery of highly selective hMC3R, hMC4R, and hMC5R analogues. J Med Chem 46:4965-73 (2003)  
Target
Name:
Melanocortin receptor 5
Synonyms:
MC-2 MC5R Melanocortin MC5 Melanocortin receptor 5 | Melanocortin receptor 5 (MC5R)
Type:
Enzyme
Mol. Mass.:
36612.92
Organism:
Homo sapiens (Human)
Description:
P33032
Residue:
325
  
Inhibitor
Name:
BDBM50134944
Synonyms:
CHEMBL409049 | H-Tyr-Val-c[Pen-Gly-His-Phe-Arg-Trp-Cys]-Arg-Phe-Gly-NH2
Type:
Small organic molecule
Emp. Form.:
C73H98N22O13S2
Mol. Mass.:
1555.829
SMILES:
CC(C)[C@H](NC(=O)[C@@H](N)Cc1ccc(O)cc1)C(=O)N[C@H]1C(=O)NCC(=O)N[C@@H](Cc2cnc[nH]2)C(=O)N[C@H](Cc2ccccc2)C(=O)N[C@@H](CCCNC(N)=N)C(=O)N[C@@H](Cc2c[nH]c3ccccc23)C(=O)N[C@@H](CSSC1(C)C)C(=O)N[C@@H](CCCNC(N)=N)C(=O)N[C@@H](Cc1ccccc1)C(=O)NCC(N)=O
: