Target
Acetylcholinesterase
Ligand
BDBM50135149
Substrate
Meas. Tech.
ChEMBL_27799 (CHEMBL636509)
Ki
126000±n/a nM
Citation
 Zaheer-Ul-Haq, ZUWellenzohn, BLiedl, KRRode, BM Molecular docking studies of natural cholinesterase-inhibiting steroidal alkaloids from Sarcococca saligna. J Med Chem 46:5087-90 (2003)  
Target
Name:
Acetylcholinesterase
Synonyms:
3.1.1.7 Acetylcholinesterase (AChE) ache
Type:
Mol. Mass.:
65900.74
Organism:
Tetronarce californica (Pacific electric ray) (Torpedo californica)
Description:
P04058
Residue:
586
  
Inhibitor
Name:
BDBM50135149
Synonyms:
Acetic acid (2S,3S,4R,5R,8S,9S,10R,13S,14S,17S)-3-benzoylamino-17-((S)-1-dimethylamino-ethyl)-2-hydroxy-10,13-dimethyl-hexadecahydro-cyclopenta[a]phenanthren-4-yl ester CHEMBL413039
Type:
Small organic molecule
Emp. Form.:
C32H48N2O4
Mol. Mass.:
524.7345
SMILES:
C[C@@H]([C@H]1CC[C@H]2[C@@H]3CC[C@H]4[C@@H](OC(C)=O)[C@@H](NC(=O)c5ccccc5)[C@@H](O)C[C@]4(C)[C@H]3CC[C@]12C)N(C)C
: