Target
Corticotropin-releasing factor receptor 1
Ligand
BDBM50135342
Substrate
Meas. Tech.
ChEBML_51118
Ki
>40000±n/a nM
Citation
 Dubowchik, GMMichne, JAZuev, DSchwartz, WScola, PMJames, CARuediger, EHPin, SSBurris, KDBalanda, LAGao, QWu, DFung, LFiedler, TBrowman, KETaber, MTZhang, J 2-arylaminothiazoles as high-affinity corticotropin-releasing factor 1 receptor (CRF1R) antagonists: synthesis, binding studies and behavioral efficacy. Bioorg Med Chem Lett 13:3997-4000 (2003)  
Target
Name:
Corticotropin-releasing factor receptor 1
Synonyms:
CRF-R CRF1 CRFR1 CRH-R 1 CRHR1 Corticotropin-releasing factor receptor 1 (CRF-1) Corticotropin-releasing hormone receptor 1
Type:
Enzyme
Mol. Mass.:
50744.31
Organism:
Homo sapiens (Human)
Description:
P34998
Residue:
444
  
Inhibitor
Name:
BDBM50135342
Synonyms:
CHEMBL340186 | {5-[(Cyclopropylmethyl-propyl-amino)-methyl]-4-trifluoromethyl-thiazol-2-yl}-(2,6-diethyl-phenyl)-amine
Type:
Small organic molecule
Emp. Form.:
C22H30F3N3S
Mol. Mass.:
425.554
SMILES:
CCCN(CC1CC1)Cc1sc(Nc2c(CC)cccc2CC)nc1C(F)(F)F
: