Target
Protein farnesyltransferase subunit beta/geranylgeranyltransferase type-1 subunit alpha
Ligand
BDBM50135360
Substrate
Meas. Tech.
ChEBML_68479
IC50
0.036000±n/a nM
Citation
 Hasvold, LAWang, WGwaltney, SLRockway, TWNelson, LTMantei, RAFakhoury, SASullivan, GMLi, QLin, NHWang, LZhang, HCohen, JGu, WZMarsh, KBauch, JRosenberg, SSham, HL Pyridone-containing farnesyltransferase inhibitors: synthesis and biological evaluation. Bioorg Med Chem Lett 13:4001-5 (2003)  
Target
Name:
Protein farnesyltransferase subunit beta/geranylgeranyltransferase type-1 subunit alpha
Synonyms:
Farnesyltransferase (FTase) Protein Farnesyltransferase (PFT) Chain B | Protein farnesyltransferase
Type:
Protein Complex
Mol. Mass.:
Description:
To express recombinant enzyme in E. coli, the cloned human alpha and beta subunits were co-expressed from a plasmid, in which their expression was translationally coupled.
Components:
This complex has 2 components.
Component 1
Name:
Protein farnesyltransferase subunit beta
Synonyms:
CAAX farnesyltransferase subunit alpha FNTB FTase-alpha GGTase-I-alpha Protein farnesyl/geranylgeranyl transferase Protein farnesyltransferase subunit beta Protein farnesyltransferase/geranylgeranyltransferase type-1 subunit alpha Ras proteins prenyltransferase subunit beta | Type I protein geranyl-geranyltransferase subunit alpha
Type:
Enzyme Subunit
Mol. Mass.:
48766.02
Organism:
Homo sapiens (Human)
Description:
Protein farnesyltransferase subunit beta
Residue:
437
  
Component 2
Name:
Protein farnesyltransferase/geranylgeranyltransferase type-1 subunit alpha
Synonyms:
CAAX farnesyltransferase alpha subunit FNTA_HUMAN FTase-alpha Geranylgeranyl Transferase (GGTase-I) Chain A Protein Farnesyltransferase (PFT) Chain A Protein farnesyltransferase Protein farnesyltransferase/geranylgeranyltransferase type I alpha subunit | Ras proteins prenyltransferase alpha
Type:
Enzyme
Mol. Mass.:
44392.46
Organism:
Homo sapiens (Human)
Description:
Recombinant human FTase.
Residue:
379
  
Inhibitor
Name:
BDBM50135360
Synonyms:
5-(3-Chloro-phenyl)-6-[(4-cyano-phenyl)-(3-methyl-3H-imidazol-4-yl)-methoxymethyl]-2-oxo-1-propyl-1,2-dihydro-pyridine-3-carbonitrile | CHEMBL128501
Type:
Small organic molecule
Emp. Form.:
C28H24ClN5O2
Mol. Mass.:
497.975
SMILES:
CCCn1c(COC(c2cncn2C)c2ccc(cc2)C#N)c(cc(C#N)c1=O)-c1cccc(Cl)c1
: