Target
Vasopressin V2 receptor
Ligand
BDBM50135418
Substrate
Meas. Tech.
ChEBML_214700
IC50
15±n/a nM
Citation
 Urbanski, MJChen, RHDemarest, KTGunnet, JLook, REricson, EMurray, WVRybczynski, PJZhang, X 2,5-disubstituted 3,4-dihydro-2H-benzo[b][1,4]thiazepines as potent and selective V2 arginine vasopressin receptor antagonists. Bioorg Med Chem Lett 13:4031-4 (2003)  
Target
Name:
Vasopressin V2 receptor
Synonyms:
ADHR AVPR2 DIR Renal-type arginine vasopressin receptor V2R_HUMAN Vasopressin V2 receptor | Vasopressin receptor
Type:
Receptor
Mol. Mass.:
40295.28
Organism:
Homo sapiens (Human)
Description:
P30518
Residue:
371
  
Inhibitor
Name:
BDBM50135418
Synonyms:
3-((S)-5-{4-[(Biphenyl-2-carbonyl)-amino]-benzoyl}-2,3,4,5-tetrahydro-benzo[b][1,4]thiazepin-2-yl)-propionic acid | CHEMBL128688
Type:
Small organic molecule
Emp. Form.:
C32H28N2O4S
Mol. Mass.:
536.641
SMILES:
OC(=O)CC[C@H]1CCN(C(=O)c2ccc(NC(=O)c3ccccc3-c3ccccc3)cc2)c2ccccc2S1
: