Target
Retinoic acid receptor RXR-gamma
Ligand
BDBM50135458
Substrate
Meas. Tech.
ChEBML_197090
Ki
12±n/a nM
Citation
 Michellys, PYBoehm, MFChen, JHGrese, TAKaranewsky, DSLeibowitz, MDLiu, SMais, DAMapes, CMReifel-Miller, AOgilvie, KMRungta, DThompson, AWTyhonas, JSYumibe, NArdecky, RJ Design and synthesis of novel RXR-selective modulators with improved pharmacological profile. Bioorg Med Chem Lett 13:4071-5 (2003)  
Target
Name:
Retinoic acid receptor RXR-gamma
Synonyms:
NR2B3 RXRG Retinoic acid receptor RXR-gamma Retinoid X receptor gamma/retinoic acid receptor alpha
Type:
PROTEIN
Mol. Mass.:
50878.26
Organism:
Homo sapiens (Human)
Description:
ChEMBL_197216
Residue:
463
  
Inhibitor
Name:
BDBM50135458
Synonyms:
(2E,4E,6E)-7-[3,5-Di-tert-butyl-2-(2,2,2-trifluoro-ethoxy)-phenyl]-6-fluoro-3-methyl-octa-2,4,6-trienoic acid | CHEMBL335242
Type:
Small organic molecule
Emp. Form.:
C25H32F4O3
Mol. Mass.:
456.5134
SMILES:
C\C(\C=C\C(\F)=C(\C)c1cc(cc(c1OCC(F)(F)F)C(C)(C)C)C(C)(C)C)=C/C(O)=O
: