Target
Retinoic acid receptor RXR-gamma
Ligand
BDBM50135453
Substrate
Meas. Tech.
ChEBML_197090
Ki
5.6±n/a nM
Citation
 Michellys, PYBoehm, MFChen, JHGrese, TAKaranewsky, DSLeibowitz, MDLiu, SMais, DAMapes, CMReifel-Miller, AOgilvie, KMRungta, DThompson, AWTyhonas, JSYumibe, NArdecky, RJ Design and synthesis of novel RXR-selective modulators with improved pharmacological profile. Bioorg Med Chem Lett 13:4071-5 (2003)  
Target
Name:
Retinoic acid receptor RXR-gamma
Synonyms:
NR2B3 RXRG Retinoic acid receptor RXR-gamma Retinoid X receptor gamma/retinoic acid receptor alpha
Type:
PROTEIN
Mol. Mass.:
50878.26
Organism:
Homo sapiens (Human)
Description:
ChEMBL_197216
Residue:
463
  
Inhibitor
Name:
BDBM50135453
Synonyms:
(2E,4E,6Z)-7-[2-(2,2-Difluoro-ethoxy)-3-isopropyl-5-thiophen-2-yl-phenyl]-3-methyl-octa-2,4,6-trienoic acid | CHEMBL130374
Type:
Small organic molecule
Emp. Form.:
C24H26F2O3S
Mol. Mass.:
432.523
SMILES:
CC(C)c1cc(cc(\C(C)=C/C=C/C(/C)=C/C(O)=O)c1OCC(F)F)-c1cccs1
: