Target
Retinoic acid receptor RXR-beta
Ligand
BDBM50135460
Substrate
Meas. Tech.
ChEBML_196926
Ki
3.9±n/a nM
Citation
 Michellys, PYBoehm, MFChen, JHGrese, TAKaranewsky, DSLeibowitz, MDLiu, SMais, DAMapes, CMReifel-Miller, AOgilvie, KMRungta, DThompson, AWTyhonas, JSYumibe, NArdecky, RJ Design and synthesis of novel RXR-selective modulators with improved pharmacological profile. Bioorg Med Chem Lett 13:4071-5 (2003)  
Target
Name:
Retinoic acid receptor RXR-beta
Synonyms:
NR2B2 RXRB Retinoic acid receptor RXR-beta Retinoid receptor
Type:
PROTEIN
Mol. Mass.:
56932.89
Organism:
Homo sapiens (Human)
Description:
ChEMBL_39045
Residue:
533
  
Inhibitor
Name:
BDBM50135460
Synonyms:
(2E,4E,6Z)-7-[4-(2,2-Difluoro-ethoxy)-4'-fluoro-5-isopropyl-biphenyl-3-yl]-3-methyl-octa-2,4,6-trienoic acid | CHEMBL133915
Type:
Small organic molecule
Emp. Form.:
C26H27F3O3
Mol. Mass.:
444.486
SMILES:
CC(C)c1cc(cc(\C(C)=C/C=C/C(/C)=C/C(O)=O)c1OCC(F)F)-c1ccc(F)cc1
: