Target
Cathepsin B
Ligand
BDBM50135537
Substrate
Meas. Tech.
ChEBML_47612
IC50
5.3±n/a nM
Citation
 Greenspan, PDClark, KLCowen, SDMcQuire, LWTommasi, RAFarley, DLQuadros, ECoppa, DEDu, ZFang, ZZhou, HDoughty, JToscano, KTWigg, AMZhou, S N-arylaminonitriles as bioavailable peptidomimetic inhibitors of cathepsin B. Bioorg Med Chem Lett 13:4121-4 (2003)  
Target
Name:
Cathepsin B
Synonyms:
APP secretase CATB_HUMAN CTSB Cathepsin B light chain | Cathepsin B1
Type:
Enzyme
Mol. Mass.:
37819.69
Organism:
Homo sapiens (Human)
Description:
gi_63102437
Residue:
339
  
Inhibitor
Name:
BDBM50135537
Synonyms:
3-{(R)-2-Cyano-2-[(S)-2-(3-oxo-indan-5-ylamino)-3-m-tolyl-propionylamino]-ethoxymethyl}-benzoic acid | CHEMBL437251
Type:
Small organic molecule
Emp. Form.:
C30H29N3O5
Mol. Mass.:
511.5684
SMILES:
Cc1cccc(C[C@H](Nc2ccc3CCC(=O)c3c2)C(=O)N[C@@H](COCc2cccc(c2)C(O)=O)C#N)c1
: