Target
Cathepsin S
Ligand
BDBM50135544
Substrate
Meas. Tech.
ChEBML_48682
IC50
1700±n/a nM
Citation
 Greenspan, PDClark, KLCowen, SDMcQuire, LWTommasi, RAFarley, DLQuadros, ECoppa, DEDu, ZFang, ZZhou, HDoughty, JToscano, KTWigg, AMZhou, S N-arylaminonitriles as bioavailable peptidomimetic inhibitors of cathepsin B. Bioorg Med Chem Lett 13:4121-4 (2003)  
Target
Name:
Cathepsin S
Synonyms:
CATS_HUMAN Cathepsin S (Cat S) | cathepsin S preproprotein
Type:
Protein
Mol. Mass.:
37507.38
Organism:
Homo sapiens (Human)
Description:
P25774
Residue:
331
  
Inhibitor
Name:
BDBM50135544
Synonyms:
2-Chloro-5-[(R)-2-cyano-2-((S)-2-phenylamino-3-m-tolyl-propionylamino)-ethoxymethyl]-benzoic acid | CHEMBL334879
Type:
Small organic molecule
Emp. Form.:
C27H26ClN3O4
Mol. Mass.:
491.966
SMILES:
Cc1cccc(C[C@H](Nc2ccccc2)C(=O)N[C@@H](COCc2ccc(Cl)c(c2)C(O)=O)C#N)c1
: