Target
Cathepsin B
Ligand
BDBM50135535
Substrate
Meas. Tech.
ChEBML_47612
IC50
5.3±n/a nM
Citation
 Greenspan, PDClark, KLCowen, SDMcQuire, LWTommasi, RAFarley, DLQuadros, ECoppa, DEDu, ZFang, ZZhou, HDoughty, JToscano, KTWigg, AMZhou, S N-arylaminonitriles as bioavailable peptidomimetic inhibitors of cathepsin B. Bioorg Med Chem Lett 13:4121-4 (2003)  
Target
Name:
Cathepsin B
Synonyms:
APP secretase CATB_HUMAN CTSB Cathepsin B light chain | Cathepsin B1
Type:
Enzyme
Mol. Mass.:
37819.69
Organism:
Homo sapiens (Human)
Description:
gi_63102437
Residue:
339
  
Inhibitor
Name:
BDBM50135535
Synonyms:
3-{(R)-2-Cyano-2-[(S)-2-(1,1-dimethyl-3-oxo-1,3-dihydro-isobenzofuran-5-ylamino)-3-m-tolyl-propionylamino]-ethoxymethyl}-benzoic acid | CHEMBL131732
Type:
Small organic molecule
Emp. Form.:
C31H31N3O6
Mol. Mass.:
541.5943
SMILES:
Cc1cccc(C[C@H](Nc2ccc3c(c2)C(=O)OC3(C)C)C(=O)N[C@@H](COCc2cccc(c2)C(O)=O)C#N)c1
: