Target
Protein phosphatase 1B
Ligand
BDBM50135692
Substrate
Meas. Tech.
ChEBML_161756
IC50
>100000±n/a nM
Citation
 Gulledge, BMAggen, JBEng, HSweimeh, KChamberlin, AR Microcystin analogues comprised only of Adda and a single additional amino acid retain moderate activity as PP1/PP2A inhibitors. Bioorg Med Chem Lett 13:2907-11 (2003)  
Target
Name:
Protein phosphatase 1B
Synonyms:
PP2C-beta PPM1B Protein phosphatase 1B Protein phosphatase 2C isoform beta
Type:
PROTEIN
Mol. Mass.:
52620.37
Organism:
Homo sapiens (Human)
Description:
ChEMBL_161756
Residue:
479
  
Inhibitor
Name:
BDBM50135692
Synonyms:
CHEMBL100880 | N-[(2E,4E)-(1S,6S,7S)-7-Methoxy-4,6-dimethyl-1-((S)-1-methyl-2-oxo-2-pyrrolidin-1-yl-ethyl)-8-phenyl-octa-2,4-dienyl]-acetamide
Type:
Small organic molecule
Emp. Form.:
C26H38N2O3
Mol. Mass.:
426.5915
SMILES:
CO[C@@H](Cc1ccccc1)[C@@H](C)\C=C(/C)\C=C\[C@H](NC(C)=O)[C@H](C)C(=O)N1CCCC1
: