Target
Protein phosphatase 1B
Ligand
BDBM50135700
Substrate
Meas. Tech.
ChEMBL_161757 (CHEMBL767318)
IC50
170000±n/a nM
Citation
 Gulledge, BMAggen, JBEng, HSweimeh, KChamberlin, AR Microcystin analogues comprised only of Adda and a single additional amino acid retain moderate activity as PP1/PP2A inhibitors. Bioorg Med Chem Lett 13:2907-11 (2003)  
Target
Name:
Protein phosphatase 1B
Synonyms:
PP2C-beta PPM1B Protein phosphatase 1B Protein phosphatase 2C isoform beta
Type:
PROTEIN
Mol. Mass.:
52620.37
Organism:
Homo sapiens (Human)
Description:
ChEMBL_161756
Residue:
479
  
Inhibitor
Name:
BDBM50135700
Synonyms:
(S)-2-((4E,6E)-(2S,3S,8S,9S)-3-Acetylamino-9-methoxy-2,6,8-trimethyl-10-phenyl-deca-4,6-dienoylamino)-propionic acid | CHEMBL97992
Type:
Small organic molecule
Emp. Form.:
C25H36N2O5
Mol. Mass.:
444.5637
SMILES:
CO[C@@H](Cc1ccccc1)[C@@H](C)\C=C(/C)\C=C\[C@H](NC(C)=O)[C@H](C)C(=O)N[C@@H](C)C(O)=O
: