Target
Peroxisome proliferator-activated receptor delta
Ligand
BDBM50135773
Substrate
Meas. Tech.
ChEMBL_154027 (CHEMBL759297)
IC50
740±n/a nM
Citation
 Xu, YMayhugh, DSaeed, AWang, XThompson, RCDominianni, SJKauffman, RFSingh, JBean, JSBensch, WRBarr, RJOsborne, JMontrose-Rafizadeh, CZink, RWYumibe, NPHuang, NLuffer-Atlas, DRungta, DMaise, DEMantlo, NB Design and synthesis of a potent and selective triazolone-based peroxisome proliferator-activated receptor alpha agonist. J Med Chem 46:5121-4 (2003)  
Target
Name:
Peroxisome proliferator-activated receptor delta
Synonyms:
NR1C2 NUCI Nuclear receptor subfamily 1 group C member 2 PPAR-beta PPARD Peroxisome proliferator-activated receptor Peroxisome proliferator-activated receptor delta
Type:
Enzyme
Mol. Mass.:
49910.45
Organism:
Homo sapiens (Human)
Description:
Q03181
Residue:
441
  
Inhibitor
Name:
BDBM50135773
Synonyms:
2-(4-{3-[1-(3,4-Dimethyl-benzyl)-4-methyl-5-oxo-4,5-dihydro-1H-[1,2,4]triazol-3-yl]-propyl}-phenoxy)-2-methyl-propionic acid | CHEMBL344282
Type:
Small organic molecule
Emp. Form.:
C25H31N3O4
Mol. Mass.:
437.5313
SMILES:
Cc1ccc(Cn2nc(CCCc3ccc(OC(C)(C)C(O)=O)cc3)n(C)c2=O)cc1C
: