Target
Peroxisome proliferator-activated receptor alpha
Ligand
BDBM50135781
Substrate
Meas. Tech.
ChEMBL_153537 (CHEMBL765406)
IC50
220±n/a nM
Citation
 Xu, YMayhugh, DSaeed, AWang, XThompson, RCDominianni, SJKauffman, RFSingh, JBean, JSBensch, WRBarr, RJOsborne, JMontrose-Rafizadeh, CZink, RWYumibe, NPHuang, NLuffer-Atlas, DRungta, DMaise, DEMantlo, NB Design and synthesis of a potent and selective triazolone-based peroxisome proliferator-activated receptor alpha agonist. J Med Chem 46:5121-4 (2003)  
Target
Name:
Peroxisome proliferator-activated receptor alpha
Synonyms:
NR1C1 PPAR PPAR-alpha PPARA_HUMAN Peroxisome proliferator-activated receptor | Peroxisome proliferator-activated receptor alpha (PPAR alpha)
Type:
Enzyme
Mol. Mass.:
52222.08
Organism:
Homo sapiens (Human)
Description:
Q07869
Residue:
468
  
Inhibitor
Name:
BDBM50135781
Synonyms:
2-Methyl-2-(4-{3-[5-oxo-1-(1-phenyl-ethyl)-4-propyl-4,5-dihydro-1H-[1,2,4]triazol-3-yl]-propyl}-phenoxy)-propionic acid | CHEMBL356170
Type:
Small organic molecule
Emp. Form.:
C26H33N3O4
Mol. Mass.:
451.5579
SMILES:
CCCn1c(CCCc2ccc(OC(C)(C)C(O)=O)cc2)nn(C(C)c2ccccc2)c1=O
: