Target
Epidermal growth factor receptor
Ligand
BDBM3294
Substrate
Meas. Tech.
ChEMBL_66889 (CHEMBL675513)
IC50
40±n/a nM
Citation
 Banerjee, RRachid, ZMcNamee, JJean-Claude, BJ Synthesis of a prodrug designed to release multiple inhibitors of the epidermal growth factor receptor tyrosine kinase and an alkylating agent: a novel tumor targeting concept. J Med Chem 46:5546-51 (2003)  
Target
Name:
Epidermal growth factor receptor
Synonyms:
EGFR_MOUSE Epidermal growth factor receptor erbB1
Type:
PROTEIN
Mol. Mass.:
134859.02
Organism:
Mus musculus
Description:
ChEMBL_305656
Residue:
1210
  
Inhibitor
Name:
BDBM3294
Synonyms:
4-Anilinoquinazoline deriv. 45 Anilinoquinazoline, 4b | CHEMBL52765
Type:
Small organic molecule
Emp. Form.:
C14H11BrN4
Mol. Mass.:
315.168
SMILES:
Nc1ccc2ncnc(Nc3cccc(Br)c3)c2c1
: