Target
Melatonin receptor type 1B
Ligand
BDBM9019
Substrate
Meas. Tech.
ChEBML_105266
Ki
0.300000±n/a nM
Citation
 Sun, LQChen, JMattson, RJEpperson, JRDeskus, JALi, WSTakaki, KHodges, DBIben, LMahle, CDOrtiz, AMolstad, DRyan, EYeleswaram, KXu, CLuo, G Heterocyclic aminopyrrolidine derivatives as melatoninergic agents. Bioorg Med Chem Lett 13:4381-4 (2003)  
Target
Name:
Melatonin receptor type 1B
Synonyms:
MTNR1B Mel-1B-R Melatonin 1B Melatonin receptor type 1B | Melatonin receptor type 2 (MT2)
Type:
Enzyme
Mol. Mass.:
40203.54
Organism:
Homo sapiens (Human)
Description:
P49286
Residue:
362
  
Inhibitor
Name:
BDBM9019
Synonyms:
CHEMBL45 N-[2-(5-methoxy-1H-indol-3-yl)ethyl]acetamide
Type:
Small organic molecule
Emp. Form.:
C13H16N2O2
Mol. Mass.:
232.2783
SMILES:
COc1ccc2[nH]cc(CCNC(C)=O)c2c1
: