Target
Tripeptidyl-peptidase 2
Ligand
BDBM50136654
Substrate
Meas. Tech.
ChEBML_211949
IC50
20±n/a nM
Citation
 Breslin, HJMiskowski, TAKukla, MJDe Winter, HLSomers, MVRoevens, PWKavash, RW Tripeptidyl-peptidase II (TPP II) inhibitory activity of (S)-2,3-dihydro-2-(1H-imidazol-2-yl)-1H-indoles, a systematic SAR evaluation. Part 2. Bioorg Med Chem Lett 13:4467-71 (2003)  
Target
Name:
Tripeptidyl-peptidase 2
Synonyms:
TPP2_RAT Tripeptidyl aminopeptidase
Type:
PROTEIN
Mol. Mass.:
138287.08
Organism:
Rattus norvegicus
Description:
ChEMBL_211948
Residue:
1249
  
Inhibitor
Name:
BDBM50136654
Synonyms:
(S)-2-Amino-3-methyl-1-[(S)-2-(5-propyl-1H-imidazol-2-yl)-2,3-dihydro-indol-1-yl]-butan-1-one | CHEMBL140875
Type:
Small organic molecule
Emp. Form.:
C19H26N4O
Mol. Mass.:
326.4359
SMILES:
CCCc1cnc([nH]1)[C@@H]1Cc2ccccc2N1C(=O)[C@@H](N)C(C)C
: