Target
Procathepsin L
Ligand
BDBM50137393
Substrate
Meas. Tech.
ChEBML_48367
Ki
2±n/a nM
Citation
 Kim, TSHague, ABLee, TILian, BTegley, CMWang, XBurgess, TLQian, YXRoss, STagari, PLin, CHMayeda, CDao, JJordan, SMohr, CCheetham, JViswanadhan, VTasker, AS (4-Piperidinylphenyl)aminoethyl amides as a novel class of non-covalent cathepsin K inhibitors. Bioorg Med Chem Lett 14:87-90 (2003)  
Target
Name:
Procathepsin L
Synonyms:
CATL1_HUMAN CTSL CTSL1 Cathepsin L Cathepsin L1 heavy chain MEP cathepsin L preproprotein
Type:
Enzyme
Mol. Mass.:
37557.19
Organism:
Homo sapiens (Human)
Description:
Purchased from Calbiochem (San Diego, CA).
Residue:
333
  
Inhibitor
Name:
BDBM50137393
Synonyms:
CHEMBL353725 | {(S)-1-[(S)-1-Benzyl-2-(4-piperidin-1-yl-phenylamino)-ethylcarbamoyl]-3-methyl-butyl}-carbamic acid benzyl ester
Type:
Small organic molecule
Emp. Form.:
C34H44N4O3
Mol. Mass.:
556.7382
SMILES:
CC(C)C[C@H](NC(=O)OCc1ccccc1)C(=O)N[C@H](CNc1ccc(cc1)N1CCCCC1)Cc1ccccc1
: