Target
Genome polyprotein
Ligand
BDBM50137738
Substrate
Meas. Tech.
ChEMBL_161070 (CHEMBL873425)
Ki
120±n/a nM
Citation
 Victor, FLamar, JSnyder, NYip, YGuo, DYumibe, NJohnson, RBWang, QMGlass, JIChen, SH P1 and P3 optimization of novel bicycloproline P2 bearing tetrapeptidyl alpha-ketoamide based HCV protease inhibitors. Bioorg Med Chem Lett 14:257-61 (2003)  
Target
Name:
Genome polyprotein
Synonyms:
Human rhinovirus A protease | Human rhinovirus B 3A protease
Type:
PROTEIN
Mol. Mass.:
44361.04
Organism:
Human rhinovirus B
Description:
ChEMBL_158953
Residue:
401
  
Inhibitor
Name:
BDBM50137738
Synonyms:
(1S,5S,6R)-2-((S)-3,3-Dimethyl-2-{(S)-3-methyl-2-[(pyrazine-2-carbonyl)-amino]-butyrylamino}-butyryl)-octahydro-cyclopenta[c]pyrrole-1-carboxylic acid [3,3-difluoro-1-((S)-(S)-1-phenyl-ethylaminooxalyl)-propyl]-amide | CHEMBL86529
Type:
Small organic molecule
Emp. Form.:
C37H49F2N7O6
Mol. Mass.:
725.8251
SMILES:
CC(C)[C@H](NC(=O)c1cnccn1)C(=O)N[C@H](C(=O)N1C[C@@H]2CCC[C@@H]2[C@H]1C(=O)N[C@@H](CC(F)F)C(=O)C(=O)N[C@@H](C)c1ccccc1)C(C)(C)C
: