Target
Vasopressin V1a/V1b receptor
Ligand
BDBM50137945
Substrate
Meas. Tech.
ChEMBL_214265 (CHEMBL821106)
IC50
3±n/a nM
Citation
 Cho, HMurakami, KNakanishi, HFujisawa, AIsoshima, HNiwa, MHayakawa, KHase, YUchida, IWatanabe, HWakitani, KAisaka, K Synthesis and structure-activity relationships of 5,6,7,8-tetrahydro-4H-thieno[3,2-b]azepine derivatives: novel arginine vasopressin antagonists. J Med Chem 47:101-9 (2003)  
Target
Name:
Vasopressin V1a/V1b receptor
Synonyms:
Vasopressin V1 receptor
Type:
Mol. Mass.:
Description:
ASSAY_ID of ChEMBL is 214265
Components:
This complex has 2 components.
Component 1
Name:
Vasopressin V1a receptor
Synonyms:
Avpr1a VASOPRESSIN V1A Vasopressin V1a receptor | Vasopressin receptor
Type:
Enzyme Catalytic Domain
Mol. Mass.:
47674.81
Organism:
RAT
Description:
VASOPRESSIN V1A AVPR1A RAT::P30560
Residue:
424
  
Component 2
Name:
Vasopressin V1b receptor
Synonyms:
Avpr1b VASOPRESSIN V1B Vasopressin receptor
Type:
Enzyme Catalytic Domain
Mol. Mass.:
47104.48
Organism:
RAT
Description:
VASOPRESSIN V1B AVPR1B RAT::P48974
Residue:
425
  
Inhibitor
Name:
BDBM50137945
Synonyms:
Biphenyl-2-carboxylic acid [2-[4-(4-methyl-piperazin-1-yl)-butoxy]-4-(5,6,7,8-tetrahydro-thieno[3,2-b]azepine-4-carbonyl)-phenyl]-amide | CHEMBL368354
Type:
Small organic molecule
Emp. Form.:
C37H42N4O3S
Mol. Mass.:
622.819
SMILES:
CN1CCN(CCCCOc2cc(ccc2NC(=O)c2ccccc2-c2ccccc2)C(=O)N2CCCCc3sccc23)CC1
: