Target
Peroxisome proliferator-activated receptor gamma
Ligand
BDBM28681
Substrate
Meas. Tech.
ChEBML_154042
EC50
120±n/a nM
Citation
 Rybczynski, PJZeck, REDudash, JCombs, DWBurris, TPYang, MOsborne, MCChen, XDemarest, KT Benzoxazinones as PPARgamma agonists. 2. SAR of the amide substituent and in vivo results in a type 2 diabetes model. J Med Chem 47:196-209 (2003)  
Target
Name:
Peroxisome proliferator-activated receptor gamma
Synonyms:
NR1C3 PPAR-gamma PPARG_HUMAN Peroxisome proliferator-activated receptor gamma (PPAR gamma) Peroxisome proliferator-activated receptor gamma (PPARĪ³) peroxisome proliferator-activated receptor gamma isoform 2
Type:
Nuclear Receptor
Mol. Mass.:
57613.46
Organism:
Homo sapiens (Human)
Description:
P37231
Residue:
505
  
Inhibitor
Name:
BDBM28681
Synonyms:
5-[(4-{2-[methyl(pyridin-2-yl)amino]ethoxy}phenyl)methyl]-1,3-thiazolidine-2,4-dione BRL 49653 CHEMBL121 [3H]rosiglitazone rosiglitazone
Type:
radiolabeled ligand
Emp. Form.:
C18H19N3O3S
Mol. Mass.:
357.427
SMILES:
CN(CCOc1ccc(Cc2sc(=O)[nH]c2O)cc1)c1ccccn1
: