Target
Heat shock protein HSP 90-alpha/90-beta
Ligand
BDBM15379
Substrate
Meas. Tech.
ChEMBL_29664 (CHEMBL636772)
IC50
>200000±n/a nM
Citation
 Dymock, BBarril, XBeswick, MCollier, ADavies, NDrysdale, MFink, AFromont, CHubbard, REMassey, ASurgenor, AWright, L Adenine derived inhibitors of the molecular chaperone HSP90-SAR explained through multiple X-ray structures. Bioorg Med Chem Lett 14:325-8 (2003)  
Target
Name:
Heat shock protein HSP 90-alpha/90-beta
Synonyms:
Heat Shock Protein 90 (Hsp90) Heat shock protein HSP90
Type:
Mol. Mass.:
Description:
ASSAY_ID of EBI is 29664
Components:
This complex has 2 components.
Component 1
Name:
Heat shock protein HSP 90-alpha
Synonyms:
HS90A_HUMAN HSP86 HSP90AA1 HSPCA Heat shock 86 kDa Heat shock protein HSP 90-alpha (HSP90) LAP-2 Lipopolysaccharide-associated protein 2 heat shock protein 90kDa alpha (cytosolic), class A member 1 isoform 2
Type:
Molecular Chaperone
Mol. Mass.:
84623.45
Organism:
Homo sapiens (Human)
Description:
P07900
Residue:
732
  
Component 2
Name:
Heat shock protein HSP 90-beta
Synonyms:
HS90B_HUMAN HSP 90 HSP90B HSPCB Heat shock protein HSP 90 (Hsp90)
Type:
Molecular Chaperone
Mol. Mass.:
83229.45
Organism:
Homo sapiens (Human)
Description:
P08238
Residue:
724
  
Inhibitor
Name:
BDBM15379
Synonyms:
9-butyl-8-(2-chloro-3,4,5-trimethoxybenzyl)-9H-purin-6-amine CHEMBL112896 Purine-Based Inhibitor 6
Type:
Small organic molecule
Emp. Form.:
C19H24ClN5O3
Mol. Mass.:
405.879
SMILES:
CCCCn1c(Cc2cc(OC)c(OC)c(OC)c2Cl)nc2c(N)ncnc12
: