Target
Cytochrome P450 2C9
Ligand
BDBM50138234
Substrate
Meas. Tech.
ChEBML_51540
IC50
32800.0±n/a nM
Citation
 Nakamura, TKakinuma, HUmemiya, HAmada, HMiyata, NTaniguchi, KBando, KSato, M Imidazole derivatives as new potent and selective 20-HETE synthase inhibitors. Bioorg Med Chem Lett 14:333-6 (2003)  
Target
Name:
Cytochrome P450 2C9
Synonyms:
(R)-limonene 6-monooxygenase CP2C9_HUMAN CYP2C9 Cytochrome P450 2C9 (CYP2C9 ) P-450MP P450 PB-1 | S-mephenytoin 4-hydroxylase
Type:
Enzyme
Mol. Mass.:
55636.33
Organism:
Homo sapiens (Human)
Description:
P11712
Residue:
490
  
Inhibitor
Name:
BDBM50138234
Synonyms:
CHEMBL114297 | [3-(4-Imidazol-1-yl-phenoxy)-propyl]-dimethyl-amine
Type:
Small organic molecule
Emp. Form.:
C14H19N3O
Mol. Mass.:
245.3202
SMILES:
CN(C)CCCOc1ccc(cc1)-n1ccnc1
: