Target
Bifunctional dihydrofolate reductase-thymidylate synthase
Ligand
BDBM50110771
Substrate
Meas. Tech.
ChEMBL_216587 (CHEMBL821379)
Ki
1.8±n/a nM
Citation
 Sirichaiwat, CIntaraudom, CKamchonwongpaisan, SVanichtanankul, JThebtaranonth, YYuthavong, Y Target guided synthesis of 5-benzyl-2,4-diamonopyrimidines: their antimalarial activities and binding affinities to wild type and mutant dihydrofolate reductases from Plasmodium falciparum. J Med Chem 47:345-54 (2004)  
Target
Name:
Bifunctional dihydrofolate reductase-thymidylate synthase
Synonyms:
DHFR-TS Dihydrofolate Reductase-Thymidylate Synthase (DHFR-TS) Mutant KICB1 PfDHFR-TS double mutant (C59R+S108N)
Type:
Enzyme
Mol. Mass.:
71822.51
Organism:
Plasmodium falciparum (isolate K1 / Thailand)
Description:
The mutant clone was prepared by cassette mutagenesis using wildtype pfDHFR as a template, and expressed in E. coli.
Residue:
608
  
Inhibitor
Name:
BDBM50110771
Synonyms:
5-[3-Methoxy-4-(3-phenyl-propoxy)-benzyl]-pyrimidine-2,4-diamine | CHEMBL22327
Type:
Small organic molecule
Emp. Form.:
C21H24N4O2
Mol. Mass.:
364.4409
SMILES:
COc1cc(Cc2cnc(N)nc2N)ccc1OCCCc1ccccc1
: