Target
Bifunctional dihydrofolate reductase-thymidylate synthase
Ligand
BDBM50138687
Substrate
Meas. Tech.
ChEMBL_55403 (CHEMBL668412)
Ki
101±n/a nM
Citation
 Sirichaiwat, CIntaraudom, CKamchonwongpaisan, SVanichtanankul, JThebtaranonth, YYuthavong, Y Target guided synthesis of 5-benzyl-2,4-diamonopyrimidines: their antimalarial activities and binding affinities to wild type and mutant dihydrofolate reductases from Plasmodium falciparum. J Med Chem 47:345-54 (2004)  
Target
Name:
Bifunctional dihydrofolate reductase-thymidylate synthase
Synonyms:
DHFR-TS Dihydrofolate Reductase-Thymidylate Synthase (DHFR-TS) Mutant KICB1 PfDHFR-TS double mutant (C59R+S108N)
Type:
Enzyme
Mol. Mass.:
71822.51
Organism:
Plasmodium falciparum (isolate K1 / Thailand)
Description:
The mutant clone was prepared by cassette mutagenesis using wildtype pfDHFR as a template, and expressed in E. coli.
Residue:
608
  
Inhibitor
Name:
BDBM50138687
Synonyms:
5-(4-(benzyloxy)benzyl)pyrimidine-2,4-diamine CHEMBL56146
Type:
Small organic molecule
Emp. Form.:
C18H18N4O
Mol. Mass.:
306.3617
SMILES:
Nc1ncc(Cc2ccc(OCc3ccccc3)cc2)c(N)n1
: