Target
Mu-type opioid receptor
Ligand
BDBM50138766
Substrate
Meas. Tech.
ChEMBL_148864 (CHEMBL756660)
Ki
3.89±n/a nM
Citation
 Vig, BSMurray, TFAldrich, JV Synthesis and opioid activity of side-chain-to-side-chain cyclic dynorphin A-(1-11) amide analogues cyclized between positions 2 and 5. 1. Substitutions in position 3. J Med Chem 47:446-55 (2004)  
Target
Name:
Mu-type opioid receptor
Synonyms:
MOR-1 Mu-type opioid receptor (MOR) OPRM_RAT Opioid receptor B Ror-b
Type:
G Protein-Coupled Receptor (GPCR)
Mol. Mass.:
44503.11
Organism:
Rattus norvegicus (rat)
Description:
Competition binding assays were carried out using membrane preparations from transfected HN9.10 cells that constitutively expressed the mu opioid receptor.
Residue:
398
  
Inhibitor
Name:
BDBM50138766
Synonyms:
CHEMBL439272 | cyclo[D-Ala3]Dyn A-(1-11)NH2
Type:
Small organic molecule
Emp. Form.:
C63H101N23O13
Mol. Mass.:
1388.6223
SMILES:
CC[C@H](C)[C@H](NC(=O)[C@H](CCCNC(N)=N)NC(=O)[C@H](CCCNC(N)=N)NC(=O)[C@H]1CNC(=O)C[C@@H](NC(=O)[C@@H](N)Cc2ccc(O)cc2)C(=O)N[C@H](C)C(=O)N[C@H](Cc2ccccc2)C(=O)N1)C(=O)N[C@@H](CCCNC(N)=N)C(=O)N1CCC[C@H]1C(=O)N[C@@H](CCCCN)C(N)=O
: