Target
Metabotropic glutamate receptor 6
Ligand
BDBM50138784
Substrate
Meas. Tech.
ChEMBL_104463 (CHEMBL713650)
EC50
147±n/a nM
Citation
 Collado, IPedregal, CBueno, ABMarcos, AGonzález, RBlanco-Urgoiti, JPérez-Castells, JSchoepp, DDWright, RAJohnson, BGKingston, AEMoher, EDHoard, DWGriffey, KITizzano, JP (2S,1'S,2'R,3'R)-2-(2'-Carboxy-3'-hydroxymethylcyclopropyl) glycine is a highly potent group 2 and 3 metabotropic glutamate receptor agonist with oral activity. J Med Chem 47:456-66 (2004)  
Target
Name:
Metabotropic glutamate receptor 6
Synonyms:
GRM6_RAT Grm6 Metabotropic glutamate receptor 6 (mGlu6) mGlu6 | metabotropic glutamate 6
Type:
Enzyme
Mol. Mass.:
95095.82
Organism:
Rattus norvegicus (Rat)
Description:
P35349
Residue:
871
  
Inhibitor
Name:
BDBM50138784
Synonyms:
(1R,2S,3R)-2-((S)-Amino-carboxy-methyl)-3-hydroxy-cyclopropanecarboxylic acid | CHEMBL140197
Type:
Small organic molecule
Emp. Form.:
C6H9NO5
Mol. Mass.:
175.1394
SMILES:
N[C@@H]([C@H]1[C@@H](O)[C@@H]1C(O)=O)C(O)=O
: