Target
Metabotropic glutamate receptor 3
Ligand
BDBM50138785
Substrate
Meas. Tech.
ChEMBL_106538 (CHEMBL714799)
Ki
>10000±n/a nM
Citation
 Collado, IPedregal, CBueno, ABMarcos, AGonzález, RBlanco-Urgoiti, JPérez-Castells, JSchoepp, DDWright, RAJohnson, BGKingston, AEMoher, EDHoard, DWGriffey, KITizzano, JP (2S,1'S,2'R,3'R)-2-(2'-Carboxy-3'-hydroxymethylcyclopropyl) glycine is a highly potent group 2 and 3 metabotropic glutamate receptor agonist with oral activity. J Med Chem 47:456-66 (2004)  
Target
Name:
Metabotropic glutamate receptor 3
Synonyms:
GPRC1C GRM3_HUMAN metabotropic glutamate 3 metabotropic glutamate 3/1c
Type:
Enzyme Catalytic Domain
Mol. Mass.:
98889.09
Organism:
Homo sapiens (Human)
Description:
metabotropic glutamate 1c 0 HUMAN::Q14832
Residue:
879
  
Inhibitor
Name:
BDBM50138785
Synonyms:
(1S,2R,3S)-2-((R)-Amino-carboxy-methyl)-3-hydroxy-cyclopropanecarboxylic acid | CHEMBL357043
Type:
Small organic molecule
Emp. Form.:
C6H9NO5
Mol. Mass.:
175.1394
SMILES:
N[C@H]([C@@H]1[C@H](O)[C@H]1C(O)=O)C(O)=O
: