Target
cGMP-specific 3',5'-cyclic phosphodiesterase
Ligand
BDBM50138929
Substrate
Meas. Tech.
ChEMBL_155353 (CHEMBL762498)
Ki
0.290000±n/a nM
Citation
 Lanter, JCSui, ZMacielag, MJFiordeliso, JJJiang, WQiu, YBhattacharjee, SKraft, PJohn, TMHaynes-Johnson, DCraig, EClancy, J Structure-activity relationships of N-acyl pyrroloquinolone PDE-5 inhibitors. J Med Chem 47:656-62 (2004)  
Target
Name:
cGMP-specific 3',5'-cyclic phosphodiesterase
Synonyms:
3',5'-cyclic phosphodiesterase PDE5 PDE5A_HUMAN Phosphodiesterase 5 (PDE5) Phosphodiesterase 5A (PDE5A) cGMP-specific 3',5'-cyclic phosphodiesterase
Type:
Protein
Mol. Mass.:
99975.83
Organism:
Homo sapiens (Human)
Description:
O76074
Residue:
875
  
Inhibitor
Name:
BDBM50138929
Synonyms:
3-Benzo[1,3]dioxol-5-yl-9-oxo-1,3,4,9-tetrahydro-pyrrolo[3,4-b]quinoline-2-carboxylic acid pyridin-4-ylmethyl ester | CHEMBL158817
Type:
Small organic molecule
Emp. Form.:
C25H19N3O5
Mol. Mass.:
441.4355
SMILES:
Oc1c2CN(C(c2nc2ccccc12)c1ccc2OCOc2c1)C(=O)OCc1ccncc1
: