Target
Bifunctional dihydrofolate reductase-thymidylate synthase
Ligand
BDBM50138945
Substrate
Meas. Tech.
ChEMBL_55275 (CHEMBL663728)
Ki
0.3±n/a nM
Citation
 Kamchonwongpaisan, SQuarrell, RCharoensetakul, NPonsinet, RVilaivan, TVanichtanankul, JTarnchompoo, BSirawaraporn, WLowe, GYuthavong, Y Inhibitors of multiple mutants of Plasmodium falciparum dihydrofolate reductase and their antimalarial activities. J Med Chem 47:673-80 (2004)  
Target
Name:
Bifunctional dihydrofolate reductase-thymidylate synthase
Synonyms:
DHFR-TS Dihydrofolate Reductase-Thymidylate Synthase (DHFR-TS) Mutant KICB1 PfDHFR-TS double mutant (C59R+S108N)
Type:
Enzyme
Mol. Mass.:
71822.51
Organism:
Plasmodium falciparum (isolate K1 / Thailand)
Description:
The mutant clone was prepared by cassette mutagenesis using wildtype pfDHFR as a template, and expressed in E. coli.
Residue:
608
  
Inhibitor
Name:
BDBM50138945
Synonyms:
1-(3-Chloro-phenyl)-6-(4-phenoxy-phenyl)-1,6-dihydro-[1,3,5]triazine-2,4-diamine CHEMBL161451
Type:
Small organic molecule
Emp. Form.:
C21H18ClN5O
Mol. Mass.:
391.854
SMILES:
NC1=NC(N(C(N)=N1)c1cccc(Cl)c1)c1ccc(Oc2ccccc2)cc1
: