Target
Bifunctional dihydrofolate reductase-thymidylate synthase
Ligand
BDBM18779
Substrate
Meas. Tech.
ChEMBL_216585 (CHEMBL821377)
Ki
0.4±n/a nM
Citation
 Kamchonwongpaisan, SQuarrell, RCharoensetakul, NPonsinet, RVilaivan, TVanichtanankul, JTarnchompoo, BSirawaraporn, WLowe, GYuthavong, Y Inhibitors of multiple mutants of Plasmodium falciparum dihydrofolate reductase and their antimalarial activities. J Med Chem 47:673-80 (2004)  
Target
Name:
Bifunctional dihydrofolate reductase-thymidylate synthase
Synonyms:
DHFR-TS Dihydrofolate Reductase-Thymidylate Synthase (DHFR-TS) Mutant KICB1 PfDHFR-TS double mutant (C59R+S108N)
Type:
Enzyme
Mol. Mass.:
71822.51
Organism:
Plasmodium falciparum (isolate K1 / Thailand)
Description:
The mutant clone was prepared by cassette mutagenesis using wildtype pfDHFR as a template, and expressed in E. coli.
Residue:
608
  
Inhibitor
Name:
BDBM18779
Synonyms:
6-ethyl-5-(4-methylphenyl)pyrimidine-2,4-diamine P17
Type:
Small organic molecule
Emp. Form.:
C13H16N4
Mol. Mass.:
228.2929
SMILES:
CCc1nc(N)nc(N)c1-c1ccc(C)cc1
: