Target
Nitric oxide synthase, brain
Ligand
BDBM50139524
Substrate
Meas. Tech.
ChEBML_144354
IC50
310±n/a nM
Citation
 Jaroch, SRehwinkel, HHölscher, PSülzle, DBurton, GHillmann, MMcDonald, FMMiklautz, H Fluorinated dihydroquinolines as potent n-NOS inhibitors. Bioorg Med Chem Lett 14:743-6 (2004)  
Target
Name:
Nitric oxide synthase, brain
Synonyms:
Constitutive NOS NC-NOS NOS type I nNOS NOS1_HUMAN Neuronal nitric oxide synthase Nitric oxide synthase, neuronal (nNOS) bNOS | nNOS
Type:
Homodimer
Mol. Mass.:
160985.98
Organism:
Homo sapiens (Human)
Description:
P29475
Residue:
1434
  
Inhibitor
Name:
BDBM50139524
Synonyms:
(3aS,9bR)-7-[3-(3-Chloro-benzylamino)-propyl]-3a-fluoro-2,3,3a,9b-tetrahydro-1H-cyclopenta[c]quinolin-4-ylamine | CHEMBL161925
Type:
Small organic molecule
Emp. Form.:
C22H25ClFN3
Mol. Mass.:
385.905
SMILES:
NC1=Nc2cc(CCCNCc3cccc(Cl)c3)ccc2[C@H]2CCC[C@@]12F
: