Target
Prothrombin
Ligand
BDBM50139746
Substrate
Meas. Tech.
ChEMBL_208309 (CHEMBL812829)
Ki
0.018±n/a nM
Citation
 Maryanoff, BE Inhibitors of serine proteases as potential therapeutic agents: the road from thrombin to tryptase to cathepsin G. J Med Chem 47:769-87 (2004)  
Target
Name:
Prothrombin
Synonyms:
Activation peptide fragment 1 Coagulation factor II Prothrombin precursor Thrombin heavy chain | Thrombin light chain
Type:
Protein
Mol. Mass.:
70029.57
Organism:
Homo sapiens (Human)
Description:
P00734
Residue:
622
  
Inhibitor
Name:
BDBM50139746
Synonyms:
(S)-1-((R)-3-Cyclohexyl-2-methylamino-propionyl)-pyrrolidine-2-carboxylic acid [(S)-1-(benzothiazole-2-carbonyl)-4-guanidino-butyl]-amide | CHEMBL353760
Type:
Small organic molecule
Emp. Form.:
C28H41N7O3S
Mol. Mass.:
555.735
SMILES:
CN[C@H](CC1CCCCC1)C(=O)N1CCC[C@H]1C(=O)N[C@@H](CCCNC(N)=N)C(=O)c1nc2ccccc2s1
: