Target
Sodium-dependent serotonin transporter
Ligand
BDBM50139958
Substrate
Meas. Tech.
ChEMBL_201479 (CHEMBL804588)
Ki
0.08±n/a nM
Citation
 Plisson, CMcConathy, JMartarello, LMalveaux, EJCamp, VMWilliams, LVotaw, JRGoodman, MM Synthesis, radiosynthesis, and biological evaluation of carbon-11 and iodine-123 labeled 2beta-carbomethoxy-3beta-[4'-((Z)-2-haloethenyl)phenyl]tropanes: candidate radioligands for in vivo imaging of the serotonin transporter. J Med Chem 47:1122-35 (2004)  
Target
Name:
Sodium-dependent serotonin transporter
Synonyms:
5-HT Transporter 5HTT SC6A4_HUMAN SLC6A4 Serotonin transporter (5HTT) Sodium-dependent serotonin transporter (SERT) | Solute carrier family 6 member 4
Type:
Multi-pass membrane protein
Mol. Mass.:
70322.51
Organism:
Homo sapiens (Human)
Description:
P31645
Residue:
630
  
Inhibitor
Name:
BDBM50139958
Synonyms:
3-[4-(2,2-Dibromo-vinyl)-phenyl]-8-aza-bicyclo[3.2.1]octane-2-carboxylic acid methyl ester | CHEMBL14257
Type:
Small organic molecule
Emp. Form.:
C17H19Br2NO2
Mol. Mass.:
429.146
SMILES:
[#6]-[#8]-[#6](=O)-[#6]-1-[#6]-2-[#6]-[#6]-[#6](-[#6]-[#6]-1-c1ccc(\[#6]=[#6](/Br)Br)cc1)-[#7]-2
: