Target
Coagulation factor X
Ligand
BDBM50140430
Substrate
Meas. Tech.
ChEBML_48666
IC50
48±n/a nM
Citation
 Jia, ZJWu, YHuang, WZhang, PSong, YWoolfrey, JSinha, UArfsten, AEEdwards, STHutchaleelaha, AHollennbach, SJLambing, JLScarborough, RMZhu, BY 1-(2-Naphthyl)-1H-pyrazole-5-carboxylamides as potent factor Xa inhibitors. Part 3: Design, synthesis and SAR of orally bioavailable benzamidine-P4 inhibitors. Bioorg Med Chem Lett 14:1229-34 (2004)  
Target
Name:
Coagulation factor X
Synonyms:
Activated coagulation factor X (FXa) Coagulation factor X precursor F10 Factor X heavy chain Factor Xa Stuart-Prower factor
Type:
Enzyme
Mol. Mass.:
54726.60
Organism:
Homo sapiens (Human)
Description:
Residue:
488
  
Inhibitor
Name:
BDBM50140430
Synonyms:
2-(3-Fluoro-naphthalen-2-yl)-5-methyl-2H-pyrazole-3-carboxylic acid {4-[N-(2-dimethylamino-ethyl)-N-methyl-carbamimidoyl]-2-fluoro-phenyl}-amide | CHEMBL418559
Type:
Small organic molecule
Emp. Form.:
C27H28F2N6O
Mol. Mass.:
490.5476
SMILES:
CN(C)CCN(C)C(=N)c1ccc(NC(=O)c2cc(C)nn2-c2cc3ccccc3cc2F)c(F)c1
: