Target
Metallo-beta-lactamase L1 type 3
Ligand
BDBM50140667
Substrate
Meas. Tech.
ChEMBL_104646 (CHEMBL712892)
IC50
10900±n/a nM
Citation
 Buynak, JDChen, HVogeti, LGadhachanda, VRBuchanan, CAPalzkill, TShaw, RWSpencer, JWalsh, TR Penicillin-derived inhibitors that simultaneously target both metallo- and serine-beta-lactamases. Bioorg Med Chem Lett 14:1299-304 (2004)  
Target
Name:
Metallo-beta-lactamase L1 type 3
Synonyms:
BLA1_STEMA | Beta-lactamase L1
Type:
PROTEIN
Mol. Mass.:
30803.13
Organism:
Stenotrophomonas maltophilia
Description:
ChEMBL_1500319
Residue:
290
  
Inhibitor
Name:
BDBM50140667
Synonyms:
(2S,5R,6R)-6-Mercaptomethyl-3,3-dimethyl-7-oxo-4-thia-1-aza-bicyclo[3.2.0]heptane-2-carboxylic acid | CHEMBL277225
Type:
Small organic molecule
Emp. Form.:
C9H13NO3S2
Mol. Mass.:
247.334
SMILES:
CC1(C)S[C@@H]2[C@@H](CS)C(=O)N2[C@H]1C(O)=O
: