Target
Beta-lactamase TEM
Ligand
BDBM50076672
Substrate
Meas. Tech.
ChEBML_197642
IC50
14600±n/a nM
Citation
 Buynak, JDChen, HVogeti, LGadhachanda, VRBuchanan, CAPalzkill, TShaw, RWSpencer, JWalsh, TR Penicillin-derived inhibitors that simultaneously target both metallo- and serine-beta-lactamases. Bioorg Med Chem Lett 14:1299-304 (2004)  
Target
Name:
Beta-lactamase TEM
Synonyms:
BLAT_ECOLX Beta-lactamase (TEM-1) Beta-lactamase TEM-1 Beta-lactamase TEM1D Beta-lactamase TEM1F TEM extended-spectrum beta-lactamase bla
Type:
Enzyme
Mol. Mass.:
31512.33
Organism:
Escherichia coli
Description:
P62593
Residue:
286
  
Inhibitor
Name:
BDBM50076672
Synonyms:
(2S,5R,6S)-6-Hydroxymethyl-3,3-dimethyl-4,4,7-trioxo-4lambda*6*-thia-1-aza-bicyclo[3.2.0]heptane-2-carboxylic acid Sodium; (2S,5R,6S)-6-hydroxymethyl-3,3-dimethyl-4,4,7-trioxo-4lambda*6*-thia-1-aza-bicyclo[3.2.0]heptane-2-carboxylate
Type:
Small organic molecule
Emp. Form.:
C9H13NO6S
Mol. Mass.:
263.268
SMILES:
CC1(C)[C@@H](N2[C@@H]([C@@H](CO)C2=O)S1(=O)=O)C(O)=O
: