Target
ATP-dependent translocase ABCB1
Ligand
BDBM50140800
Substrate
Meas. Tech.
ChEMBL_147986 (CHEMBL754111)
IC50
13050±n/a nM
Citation
 Wang, SFolkes, AChuckowree, ICockcroft, XSohal, SMiller, WMilton, JWren, SPVicker, NDepledge, PScott, JSmith, LJones, HMistry, PFaint, RThompson, DCocks, S Studies on pyrrolopyrimidines as selective inhibitors of multidrug-resistance-associated protein in multidrug resistance. J Med Chem 47:1329-38 (2004)  
Target
Name:
ATP-dependent translocase ABCB1
Synonyms:
ATP-binding cassette sub-family B member 1 Abcb1b MDR1B_MOUSE Mdr1b P-glycoprotein 1 Pgy1 | Pgy1-1
Type:
PROTEIN
Mol. Mass.:
141009.67
Organism:
Mus musculus
Description:
ChEMBL_474396
Residue:
1276
  
Inhibitor
Name:
BDBM50140800
Synonyms:
2-Iodo-4-(4-phenethyl-piperazin-1-yl)-6,7,8,9-tetrahydro-pyrimido[4,5-b]indolizine-10-carbonitrile | CHEMBL27823
Type:
Small organic molecule
Emp. Form.:
C23H25IN6
Mol. Mass.:
512.3893
SMILES:
Ic1nc(N2CCN(CCc3ccccc3)CC2)c2n3CCCCc3c(C#N)c2n1
: