Target
ATP-dependent translocase ABCB1
Ligand
BDBM50140812
Substrate
Meas. Tech.
ChEMBL_147986 (CHEMBL754111)
IC50
3700±n/a nM
Citation
 Wang, SFolkes, AChuckowree, ICockcroft, XSohal, SMiller, WMilton, JWren, SPVicker, NDepledge, PScott, JSmith, LJones, HMistry, PFaint, RThompson, DCocks, S Studies on pyrrolopyrimidines as selective inhibitors of multidrug-resistance-associated protein in multidrug resistance. J Med Chem 47:1329-38 (2004)  
Target
Name:
ATP-dependent translocase ABCB1
Synonyms:
ATP-binding cassette sub-family B member 1 Abcb1b MDR1B_MOUSE Mdr1b P-glycoprotein 1 Pgy1 | Pgy1-1
Type:
PROTEIN
Mol. Mass.:
141009.67
Organism:
Mus musculus
Description:
ChEMBL_474396
Residue:
1276
  
Inhibitor
Name:
BDBM50140812
Synonyms:
10-(5-Methyl-[1,2,4]oxadiazol-3-yl)-4-(4-phenethyl-piperazin-1-yl)-6,7,8,9-tetrahydro-pyrimido[4,5-b]indolizine | CHEMBL285576
Type:
Small organic molecule
Emp. Form.:
C25H29N7O
Mol. Mass.:
443.5441
SMILES:
Cc1nc(no1)-c1c2CCCCn2c2c(ncnc12)N1CCN(CCc2ccccc2)CC1
: